BDBM50430316 CHEMBL2333873
SMILES Cn1cc(cn1)-c1ccc(CN2C(=O)C3(CCN(C3)C3CCCCCC3)c3ccccc23)c(F)c1
InChI Key InChIKey=FQZBVAPUXRWNMC-UHFFFAOYSA-N
Data  1 EC50
  Tab Delimited (TSV)   2D SDfile   Computed 3D by Vconf -m prep SDfile
Find this compound or compounds like it in BindingDB:
Activity Spreadsheet -- Enzyme Inhibition Constant Data from BindingDB
Found 1 hit for monomerid = 50430316
TargetMuscarinic acetylcholine receptor M1(Homo sapiens (Human))
Vanderbilt University Medical Center
Curated by ChEMBL
LigandPNGBDBM50430316(CHEMBL2333873)
Affinity DataEC50:  7.50E+3nM. Assay description: Positive allosteric modulation of human muscarinic M1 receptor
In DepthDetails ArticlePubMed